I am trying to build mqtt paho app for WP76xx and i am getting followirg error
Can anyone help me with this
make: *** [target] Error 1
FAILED: cd /tmp/build/mqttClient/Target_Legato_Debug/component/26c0b9da9a3a83cde00630005d15edde && export CFLAGS="–sysroot=/opt/swi/SWI9X07Y_02.28.03.01/sysroots/armv7a-neon-poky-linux-gnueabi -g -I /tmp/build/mqttClient/Target_Legato_Debug -I/legato/interfaces -I/legato/framework/include -I/legato/build/wp76xx/framework/include -I/legato/interfaces/airVantage/legacy -I/legato/interfaces -I/legato/interfaces/wifi -I/legato/interfaces/watchdog -I/legato/interfaces/positioning -I/legato/interfaces/secureStorage -I/legato/interfaces/supervisor -I/legato/interfaces/modemServices -I/legato/interfaces/atServices -I/legato/interfaces/logDaemon -I/legato/interfaces/airVantage -I/legato/interfaces/portService -IC:\Users\CC\Downloads\MQTT\MqttClient-use_paho_linux_version\MqttClient-use_paho_linux_version" CXXFLAGS="–sysroot=/opt/swi/SWI9X07Y_02.28.03.01/sysroots/armv7a-neon-poky-linux-gnueabi -g -I /tmp/build/mqttClient/Target_Legato_Debug -I/legato/interfaces -I/legato/framework/include -I/legato/build/wp76xx/framework/include -I/legato/interfaces/airVantage/legacy -I/legato/interfaces -I/legato/interfaces/wifi -I/legato/interfaces/watchdog -I/legato/interfaces/positioning -I/legato/interfaces/secureStorage -I/legato/interfaces/supervisor -I/legato/interfaces/modemServices -I/legato/interfaces/atServices -I/legato/interfaces/logDaemon -I/legato/interfaces/airVantage -I/legato/interfaces/portService -IC:\Users\CC\Downloads\MQTT\MqttClient-use_paho_linux_version\MqttClient-use_paho_linux_version" LDFLAGS="–sysroot=/opt/swi/SWI9X07Y_02.28.03.01/sysroots/armv7a-neon-poky-linux-gnueabi -g" CPPFLAGS="–sysroot=/opt/swi/SWI9X07Y_02.28.03.01/sysroots/armv7a-neon-poky-linux-gnueabi " PATH="${LEGATO_ROOT}/bin:/opt/swi/SWI9X07Y_02.28.03.01/sysroots/x86_64-pokysdk-linux/usr/bin/arm-poky-linux-gnueabi:/opt/swi/SWI9X07Y_02.28.03.01/sysroots/x86_64-pokysdk-linux/usr/bin:/opt/swi/SWI9X07Y_02.28.03.01/sysroots/x86_64-pokysdk-linux/bin:/opt/swi/SWI9X07Y_02.28.03.01/sysroots/x86_64-pokysdk-linux/sbin:$PATH" && make -C C:\Users\CC\Downloads\MQTT\MqttClient-use_paho_linux_version\MqttClient-use_paho_linux_version/pahoLegatoComponent/paho.mqtt.c blddir=build/output_wp76xx
make[1]: Entering directory ‘C:\Users\CC\Downloads\MQTT\MqttClient-use_paho_linux_version\MqttClient-use_paho_linux_version/pahoLegatoComponent/paho.mqtt.c’
mkdir -p build/output_wp76xx/samples
mkdir -p build/output_wp76xx/test
echo OSTYPE is Linux
OSTYPE is Linux
/opt/swi/SWI9X07Y_02.28.03.01/sysroots/x86_64-pokysdk-linux/usr/bin/arm-poky-linux-gnueabi/arm-poky-linux-gnueabi-gcc --sysroot=/opt/swi/SWI9X07Y_02.28.03.01/sysroots/armv7a-neon-poky-linux-gnueabi -g -I src -lpthread -L build/output_wp76xx -o build/output_wp76xx/MQTTVersion -lpaho-mqtt3a src/MQTTVersion.c -ldl
/opt/swi/SWI9X07Y_02.28.03.01/sysroots/x86_64-pokysdk-linux/usr/libexec/arm-poky-linux-gnueabi/gcc/arm-poky-linux-gnueabi/7.3.0/real-ld: cannot find -lpaho-mqtt3a
collect2: error: ld returned 1 exit status
Makefile:234: recipe for target ‘build/output_wp76xx/MQTTVersion’ failed
make[1]: *** [build/output_wp76xx/MQTTVersion] Error 1
make[1]: Leaving directory ‘C:\Users\CC\Downloads\MQTT\MqttClient-use_paho_linux_version\MqttClient-use_paho_linux_version/pahoLegatoComponent/paho.mqtt.c’
ninja: build stopped: subcommand failed.
Makefile:37: recipe for target ‘target’ failed
make: Leaving directory ‘C:\Users\CC\Downloads\MQTT\MqttClient-use_paho_linux_version\MqttClient-use_paho_linux_version/Target_Legato_Debug’
“cannot find -lpaho-mqtt3a
collect2: error: ld returned 1 exit status”